working diagnosis
has metadata:
  namespace: directives.org.iso
  key: admittedTerms
  value: working hypothesis
has metadata:
  namespace: directives.org.iso
  key: figureTitle
  value: Figure 20 — working diagnosis (UML Representation)
has metadata:
  namespace: directives.org.iso
  key: note 1
  value: A working diagnosis is used as a label for the considered condition that one or more care professionals assess as the most probable health condition and that could be concluded after further observations. The basis for such assessments is the already observed conditions.
has metadata:
  namespace: directives.org.iso
  key: note 2
  value: Different care professionals may make different interpretations and assessments of the observed conditions and thereby come to different conclusions and different working.
has metadata:
  namespace: directives.org.iso
  key: note 3
  value: A working diagnosis is often identified in the continuity of care process as a summary after the planned care investigations are completed. A working diagnosis in this stage is often called a diagnosis. An excluded condition could correspondingly be called a negation of a working diagnosis.
has metadata:
  namespace: directives.org.iso
  key: plural
  value: working diagnoses
has metadata:
  namespace: directives.org.iso
  key: termClause
  value: 3.2.19
has metadata:
  namespace: directives.org.iso
  key: _profiled
  value: Yes
has metadata:
  namespace: uk.ac.ox.softeng.maurodatamapper.xmi
  key: isAbstract
  value: false
type: Class
comment: professionally assessed condition that one or more care professionals have determined to be the most consistent with observed conditions
subclass of: professionally assessed condition
subclass of: Restriction
  min qualified cardinality: 1
  on class: observed condition