adverse event
subclass of: unintended event

unintended event
type: Class
has metadata:
  key: clauseType
  namespace: directives.org.iso
  value: bodyAndTerm
has metadata:
  key: example1
  namespace: directives.org.iso
  value: Surgical complication (anatomy and tissue reacts in an unexpected manner).
has metadata:
  key: example2
  namespace: directives.org.iso
  value: Electrical failure.
has metadata:
  key: example3
  namespace: directives.org.iso
  value: Contamination in a medicinal product.
has metadata:
  key: example4
  namespace: directives.org.iso
  value: Hardware failure.
has metadata:
  key: example5
  namespace: directives.org.iso
  value: Spontaneous recovery when the subject of care is awaiting therapy.
has metadata:
  key: figureTitle
  namespace: directives.org.iso
  value: Figure 110 — unintended event (UML Representation)
has metadata:
  key: note 1
  namespace: directives.org.iso
  value: An unintended event can be either expected or unexpected.
has metadata:
  key: note 2
  namespace: directives.org.iso
  value: Activities in a process are deliberate and have a purpose. In an ideal situation purposes are always fulfilled. If an activity in whatever other process has an impact on the process currently analysed, the effect of this activity is perceived by the current process as an unintended event. Then the course of the process may deviate from the expected one. Such an exception from the desired course might prove negative or positive in comparison to the desired process outcome.
has metadata:
  key: termClause
  namespace: directives.org.iso
  value: 3.7.12
has metadata:
  key: _profiled
  namespace: directives.org.iso
  value: Yes
has metadata:
  key: isAbstract
  namespace: uk.ac.ox.softeng.maurodatamapper.xmi
  value: false
comment: phenomenon that is not part of the normal course of a process
subclass of: event