target condition
type: Class
has metadata:
  key: admittedTerms
  namespace: directives.org.iso
  value: target health condition
has metadata:
  key: example1
  namespace: directives.org.iso
  value: The target condition for a worker that arrived at the emergency room with a broken arm is to be fully functional for work in the shortest period.
has metadata:
  key: example2
  namespace: directives.org.iso
  value: The target condition of a newly diagnosed diabetic adolescent boy is maintenance of his HbA1c at less than 48 mmol/mol. [HbA1c is a lab test that shows the average level of blood sugar (glucose) over the previous 3 months; it shows how well diabetes is being controlled].
has metadata:
  key: figureTitle
  namespace: directives.org.iso
  value: Figure 23 — target condition (UML Representation)
has metadata:
  key: note 1
  namespace: directives.org.iso
  value: Assessment of needs for care activities includes identification of intended outcomes or care goals. These inform decisions about relevant activities to create or update the care plan.
has metadata:
  key: plural
  namespace: directives.org.iso
  value: target conditions
has metadata:
  key: termClause
  namespace: directives.org.iso
  value: 3.2.22
has metadata:
  key: _profiled
  namespace: directives.org.iso
  value: Yes
has metadata:
  key: isAbstract
  namespace: uk.ac.ox.softeng.maurodatamapper.xmi
  value: false
comment: potential health condition representing either intended outcomes or care goals
subclass of: potential health condition
subclass of: Restriction
  min qualified cardinality: 1
  on class: intended outcome
subclass of: Restriction
  min qualified cardinality: 1
  on class: care goal