subject of care proxy
type: Concept
alternative label: subject of care agent
broader: healthcare third party
broader: person role
definition: healthcare third party having person role with the right to take decisions on behalf of the subject of care
in scheme: contsys.org
note: NOTE In ISO/TS 21298 subject of care agent is the preferred term for this concept.
related: consent competence
related: dissent
related: informed consent
related: personal health record
related: reason for demand for care
related: subject of care
related: subject of care desire

hasPart
type: Property
comment: Expresses a partitive relationship between two concepts.
sub property of: narrower
inverse of: isPartOf

isPartOf
type: Property
comment: Expresses a partitive relationship between two concepts.
sub property of: broader
inverse of: hasPart