subject of care preference delay
type: Class
comment: care activity delay by the preference of the subject of care
has metadata:
  namespace: directives.org.iso
  key: clauseType
  value: bodyAndTerm
has metadata:
  namespace: directives.org.iso
  key: example1
  value: Surgery delayed enabling the subject of care to undertake seasonal work.
has metadata:
  namespace: directives.org.iso
  key: example2
  value: Investigation delayed supporting the subject of care’s scheduling choice.
has metadata:
  namespace: directives.org.iso
  key: figureTitle
  value: Figure 97 — subject of care preference delay (UML Representation)
has metadata:
  namespace: directives.org.iso
  key: plural
  value: subject of care preference delays
has metadata:
  namespace: directives.org.iso
  key: termClause
  value: 3.6.16
has metadata:
  namespace: directives.org.iso
  key: _profiled
  value: Yes
has metadata:
  namespace: uk.ac.ox.softeng.maurodatamapper.xmi
  key: isAbstract
  value: false
subclass of: care activity delay
subclass of: Restriction
  min qualified cardinality: 1
  on class: subject of care