subject of care
type: Class
comment: person seeking to receive, receiving, or having received care
has metadata:
  namespace: directives.org.iso
  key: admittedTerms
  value: patient, client, service user, consumer
has metadata:
  namespace: directives.org.iso
  key: clauseType
  value: bodyAndTerm
has metadata:
  namespace: directives.org.iso
  key: example1
  value: A treated patient.
has metadata:
  namespace: directives.org.iso
  key: example2
  value: A client of a physiotherapist.
has metadata:
  namespace: directives.org.iso
  key: example3
  value: Each member of a target population for screening.
has metadata:
  namespace: directives.org.iso
  key: example4
  value: Each member of a group of diabetic people attending a session of medical education.
has metadata:
  namespace: directives.org.iso
  key: example5
  value: A person seeking health advice.
has metadata:
  namespace: directives.org.iso
  key: figureTitle
  value: Figure 30 — subject of care (UML Representation)
has metadata:
  namespace: directives.org.iso
  key: note 1
  value: A fœtus may be considered as a subject of care when receiving care.
has metadata:
  namespace: directives.org.iso
  key: plural
  value: subjects of care
has metadata:
  namespace: directives.org.iso
  key: termClause
  value: 3.3.2
has metadata:
  namespace: directives.org.iso
  key: _profiled
  value: Yes
has metadata:
  namespace: uk.ac.ox.softeng.maurodatamapper.xmi
  key: isAbstract
  value: false
subclass of: care actor
subclass of: role
subclass of: Restriction
  qualified cardinality: 1
  on class: social environment
subclass of: Restriction
  min qualified cardinality: 1
  on class: care
subclass of: Restriction
  max qualified cardinality: 1
  on class: self-care performer