social record extract
type: Class
comment: part or all of a social record extracted for the purpose of communication
has metadata:
  namespace: directives.org.iso
  key: clauseType
  value: bodyAndTerm
has metadata:
  namespace: directives.org.iso
  key: figureTitle
  value: Figure 137 — social record extract (UML Representation)
has metadata:
  namespace: directives.org.iso
  key: plural
  value: social record extracts
has metadata:
  namespace: directives.org.iso
  key: termClause
  value: 3.9.10
has metadata:
  namespace: directives.org.iso
  key: _profiled
  value: Yes
subclass of: health record extract