social need
type: Class
comment: health need related to social determinants of health
has metadata:
  namespace: directives.org.iso
  key: clauseType
  value: bodyAndTerm
has metadata:
  namespace: directives.org.iso
  key: example1
  value: Loss of job.
has metadata:
  namespace: directives.org.iso
  key: example2
  value: Gambling addiction.
has metadata:
  namespace: directives.org.iso
  key: example3
  value: Loss of personal autonomy.
has metadata:
  namespace: directives.org.iso
  key: example4
  value: Physical or mental disability.
has metadata:
  namespace: directives.org.iso
  key: figureTitle
  value: Figure 27 — social need (UML Representation)
has metadata:
  namespace: directives.org.iso
  key: plural
  value: social needs
has metadata:
  namespace: directives.org.iso
  key: termClause
  value: 3.2.26
has metadata:
  namespace: directives.org.iso
  key: _profiled
  value: Yes
subclass of: health need