social issue
subclass of: social matter

social matter
has metadata:
  namespace: directives.org.iso
  key: figureTitle
  value: Figure 6 — social matter (UML Representation)
has metadata:
  namespace: directives.org.iso
  key: plural
  value: social matters
has metadata:
  namespace: directives.org.iso
  key: termClause
  value: 3.2.5
has metadata:
  namespace: directives.org.iso
  key: _profiled
  value: Yes
type: Class
comment: health matter concerning how a subject of care lives in their social environment
subclass of: health matter