social environment
has metadata:
  namespace: directives.org.iso
  key: admittedTerms
  value: milieu
has metadata:
  namespace: directives.org.iso
  key: figureTitle
  value: Figure 25 — social environment (UML Representation)
has metadata:
  namespace: directives.org.iso
  key: note 1
  value: Adapted from Reference [36].
has metadata:
  namespace: directives.org.iso
  key: plural
  value: social environments
has metadata:
  namespace: directives.org.iso
  key: termClause
  value: 3.2.24
has metadata:
  namespace: directives.org.iso
  key: _profiled
  value: Yes
has metadata:
  namespace: ontology.external
  key: iri.dolce
  value: https://w3id.org/DOLCE/OWL/DOLCEbasic#State
has metadata:
  namespace: ontology.external
  key: prefix.dolce
  value: db
has metadata:
  namespace: ontology.external
  key: rdfsSubClassOf.dolce
  value: https://w3id.org/DOLCE/OWL/DOLCEbasic#State
has metadata:
  namespace: ontology.type
  key: ontologyId
  value: dolce=State
type: Class
comment: immediate physical and social setting in which a person lives and interacts
subclass of: State