social care report
type: Class
comment: social record extract conveying specifically focused social care information in order to fulfil current information needs of the recipient
has metadata:
  namespace: directives.org.iso
  key: clauseType
  value: bodyAndTerm
has metadata:
  namespace: directives.org.iso
  key: example1
  value: Report on the home visit done by the social worker.
has metadata:
  namespace: directives.org.iso
  key: example2
  value: Disability level measured adopting a specific scale method.
has metadata:
  namespace: directives.org.iso
  key: figureTitle
  value: Figure 139 — social care report (UML Representation)
has metadata:
  namespace: directives.org.iso
  key: plural
  value: social care reports
has metadata:
  namespace: directives.org.iso
  key: termClause
  value: 3.9.12
has metadata:
  namespace: directives.org.iso
  key: _profiled
  value: Yes
subclass of: health report