social care activity mandate
has metadata:
  namespace: directives.org.iso
  key: figureTitle
  value: Figure 122 — social care activity mandate (UML Representation)
has metadata:
  namespace: directives.org.iso
  key: plural
  value: social care activity mandates
has metadata:
  namespace: directives.org.iso
  key: termClause
  value: 3.8.10
has metadata:
  namespace: directives.org.iso
  key: _profiled
  value: Yes
type: Class
comment: care mandate to provide needed social care
subclass of: care activity mandate