self-care performer
type: Class
comment: role played by a subject of care when performing self-care
has metadata:
  namespace: directives.org.iso
  key: clause
  value: 3
has metadata:
  namespace: directives.org.iso
  key: clauseType
  value: bodyAndTerm
has metadata:
  namespace: directives.org.iso
  key: figureTitle
  value: Figure 42 — self-care performer (UML Representation)
has metadata:
  namespace: directives.org.iso
  key: plural
  value: self-care performers
has metadata:
  namespace: directives.org.iso
  key: termClause
  value: 3.3.14
has metadata:
  namespace: directives.org.iso
  key: _profiled
  value: Yes
subclass of: care performer
subclass of: Restriction
  min qualified cardinality: 1
  on class: self-care