prescribed self-care
subclass of: self-care

self-care
has metadata:
  namespace: directives.org.iso
  key: clauseType
  value: bodyAndTerm
has metadata:
  namespace: directives.org.iso
  key: deprecatedTerms
  value: health self-care activity
has metadata:
  namespace: directives.org.iso
  key: example1
  value: Self injection of insulin, self-measurement of blood pressure, or of glycaemia, yoga, taking a bath, meditation, mindfulness.
has metadata:
  namespace: directives.org.iso
  key: figureTitle
  value: Figure 56 — self-care (UML Representation)
has metadata:
  namespace: directives.org.iso
  key: note 1
  value: Two kinds of self-care should be distinguished: — prescribed self-care, included in a care plan and documented in the professional health record; — self-care that is not prescribed.
has metadata:
  namespace: directives.org.iso
  key: plural
  value: self-care
has metadata:
  namespace: directives.org.iso
  key: termClause
  value: 3.4.5
has metadata:
  namespace: directives.org.iso
  key: _profiled
  value: Yes
has metadata:
  namespace: uk.ac.ox.softeng.maurodatamapper.xmi
  key: isAbstract
  value: false
type: Class
comment: care activity performed by the subject of care
subclass of: care activity
subclass of: Restriction
  min qualified cardinality: 1
  on class: non-ratified care information