risk condition
type: Concept
alternative label: risk health condition
broader: potential health condition
definition: potential health condition representing an unintended future health state
in scheme: contsys.org
note: NOTE While a risk is defined as the combination of a probability of an event and its consequences, the risk condition deals only with the consequences.

hasPart
type: Property
comment: Expresses a partitive relationship between two concepts.
sub property of: narrower
inverse of: isPartOf

isPartOf
type: Property
comment: Expresses a partitive relationship between two concepts.
sub property of: broader
inverse of: hasPart