risk condition
type: Class
comment: health condition representing a potential undesired future health state
has metadata:
  namespace: directives.org.iso
  key: admittedTerms
  value: risk health condition
has metadata:
  namespace: directives.org.iso
  key: figureTitle
  value: Figure 24 — risk condition (UML Representation)
has metadata:
  namespace: directives.org.iso
  key: note 1
  value: While a risk is defined as the combination of a probability of an event and its consequences, the risk condition deals only with the consequences.
has metadata:
  namespace: directives.org.iso
  key: note 2
  value: A risk condition can be a result of a current vulnerability.
has metadata:
  namespace: directives.org.iso
  key: plural
  value: risk conditions
has metadata:
  namespace: directives.org.iso
  key: termClause
  value: 3.2.23
has metadata:
  namespace: directives.org.iso
  key: _profiled
  value: Yes
has metadata:
  namespace: uk.ac.ox.softeng.maurodatamapper.xmi
  key: isAbstract
  value: false
subclass of: potential health condition