risk
type: Class
comment: combination of the probability of occurrence of harm and the severity of that harm
has metadata:
  namespace: directives.org.iso
  key: clauseType
  value: bodyAndTerm
has metadata:
  namespace: directives.org.iso
  key: note 1
  value: The probability of occurrence includes the exposure to a hazardous situation and the possibility to avoid or limit the harm.
has metadata:
  namespace: directives.org.iso
  key: plural
  value: risks
has metadata:
  namespace: directives.org.iso
  key: termClause
  value: 3.1.15
has metadata:
  namespace: directives.org.iso
  key: _profiled
  value: Yes
has metadata:
  namespace: ontology.external
  key: iri.dolce
  value: https://w3id.org/DOLCE/OWL/DOLCEbasic#MentalObject
has metadata:
  namespace: ontology.external
  key: prefix.dolce
  value: db
has metadata:
  namespace: ontology.external
  key: rdfsSubClassOf.dolce
  value: https://w3id.org/DOLCE/OWL/DOLCEbasic#MentalObject
has metadata:
  namespace: ontology.type
  key: ontologyId
  value: dolce=MentalObject
has metadata:
  namespace: uk.ac.ox.softeng.maurodatamapper.xmi
  key: isAbstract
  value: false
subclass of: MentalObject