resultant condition
has metadata:
  namespace: directives.org.iso
  key: example1
  value: Care process result, care activity result.
has metadata:
  namespace: directives.org.iso
  key: figureTitle
  value: Figure 22 — resultant condition (UML Representation)
has metadata:
  namespace: directives.org.iso
  key: note 1
  value: A resultant condition can represent the output health state after a single care activity, a bundle of care investigations or care treatments, or both, in a care process, or the outcome after a complete continuity of care process.
has metadata:
  namespace: directives.org.iso
  key: plural
  value: resultant conditions
has metadata:
  namespace: directives.org.iso
  key: termClause
  value: 3.2.21
has metadata:
  namespace: directives.org.iso
  key: _profiled
  value: Yes
has metadata:
  namespace: uk.ac.ox.softeng.maurodatamapper.xmi
  key: isAbstract
  value: false
type: Class
comment: health condition representing an output health state
subclass of: health condition