resource delay
type: Concept
broader: healthcare activity delay
definition: healthcare activity delay caused by resource constraints where there is no health condition delay
example: EXAMPLE 1 healthcare activity scheduled later than clinically indicated to allow resources to be deployed on other subjects of care (a waiting list) EXAMPLE 2 healthcare activity postponed while necessary financial resources are identified
in scheme: contsys.org
related: healthcare provider

hasPart
type: Property
comment: Expresses a partitive relationship between two concepts.
sub property of: narrower
inverse of: isPartOf

isPartOf
type: Property
comment: Expresses a partitive relationship between two concepts.
sub property of: broader
inverse of: hasPart