request mandate
type: Class
has metadata:
  key: admittedTerms
  namespace: directives.org.iso
has metadata:
  key: clauseType
  namespace: directives.org.iso
  value: bodyAndTerm
has metadata:
  key: deprecatedTerms
  namespace: directives.org.iso
  value: demand mandate, demand commission
has metadata:
  key: example1
  namespace: directives.org.iso
  value: A subject of care requesting care from a general practitioner.
has metadata:
  key: example2
  namespace: directives.org.iso
  value: Care for a child requested by a parent.
has metadata:
  key: example3
  namespace: directives.org.iso
  value: A passer-by may, in some jurisdictions, be obliged to seek care for any endangered person, for example unconscious after a road accident.
has metadata:
  key: figureTitle
  namespace: directives.org.iso
  value: Figure 125 — request mandate (UML Representation)
has metadata:
  key: note 1
  namespace: directives.org.iso
  value: A request for care is usually made by a subject of care themselves, but there are circumstances where the subject of care is not in the position of making a request for care. In that case, it may be made on their behalf by another person, such as decision-making representative with power of attorney.
has metadata:
  key: note 2
  namespace: directives.org.iso
  value: Within certain jurisdictions a generic request mandate may be explicitly or implicitly assigned to certain categories of citizens on the basis of their specific roles. It may also be directly or indirectly made necessary by law that such generic mandates are explicitly established.
has metadata:
  key: note 3
  namespace: directives.org.iso
  value: Every care professional with authority (mandate to manage health matters of a subject of care) is entitled to request services and has a request mandate.
has metadata:
  key: termClause
  namespace: directives.org.iso
  value: 3.8.13
has metadata:
  key: _profiled
  namespace: directives.org.iso
  value: Yes
has metadata:
  key: isAbstract
  namespace: uk.ac.ox.softeng.maurodatamapper.xmi
  value: false
comment: care mandate implying the right and obligation to request care activities
subclass of: care mandate