referral
has metadata:
  namespace: directives.org.iso
  key: clauseType
  value: bodyAndTerm
has metadata:
  namespace: directives.org.iso
  key: example1
  value: A referral from an orthopaedic surgeon to a rehabilitation service.
has metadata:
  namespace: directives.org.iso
  key: figureTitle
  value: Figure 78 — referral (UML Representation)
has metadata:
  namespace: directives.org.iso
  key: note 1
  value: An accepted referral transfers the continuity responsibility for the health issues specified in the referral.
has metadata:
  namespace: directives.org.iso
  key: plural
  value: referrals
has metadata:
  namespace: directives.org.iso
  key: termClause
  value: 3.5.7
has metadata:
  namespace: directives.org.iso
  key: _profiled
  value: Yes
has metadata:
  namespace: uk.ac.ox.softeng.maurodatamapper.xmi
  key: isAbstract
  value: false
type: Class
comment: request for care where a care professional asks a care provider to make a care commitment for a care period mandate
subclass of: request for care
subclass of: Restriction
  min qualified cardinality: 1
  on class: care contact
subclass of: Restriction
  qualified cardinality: 1
  on class: care commitment