real value
type: Concept
broader: data value
definition: data value used for representing a rational number
in scheme: contsys.org
note: NOTE This DATA_VALUE specialization is equivalent to ISO 21090:2011 REAL data type.

hasPart
type: Property
comment: Expresses a partitive relationship between two concepts.
sub property of: narrower
inverse of: isPartOf

isPartOf
type: Property
comment: Expresses a partitive relationship between two concepts.
sub property of: broader
inverse of: hasPart