prognostic condition
has metadata:
  namespace: directives.org.iso
  key: figureTitle
  value: Figure 21 — prognostic condition (UML Representation)
has metadata:
  namespace: directives.org.iso
  key: plural
  value: prognostic conditions
has metadata:
  namespace: directives.org.iso
  key: synonym
  value: prognostic health condition
has metadata:
  namespace: directives.org.iso
  key: termClause
  value: 3.2.20
has metadata:
  namespace: directives.org.iso
  key: _profiled
  value: Yes
has metadata:
  namespace: uk.ac.ox.softeng.maurodatamapper.xmi
  key: isAbstract
  value: false
type: Class
comment: potential health condition representing the expected course of a health state as assessed by care professionals
subclass of: potential health condition
subclass of: Restriction
  min qualified cardinality: 1
  on class: professionally assessed condition