professionally assessed condition
type: Class
comment: observed condition assessed by a care professional
has metadata:
  namespace: directives.org.iso
  key: figureTitle
  value: Figure 17 — professionally assessed condition (UML Representation)
has metadata:
  namespace: directives.org.iso
  key: plural
  value: professionally assessed conditions
has metadata:
  namespace: directives.org.iso
  key: synonym
  value: professionally assessed health condition
has metadata:
  namespace: directives.org.iso
  key: termClause
  value: 3.2.16
has metadata:
  namespace: directives.org.iso
  key: _profiled
  value: Yes
has metadata:
  namespace: uk.ac.ox.softeng.maurodatamapper.xmi
  key: isAbstract
  value: false
subclass of: considered condition
subclass of: observed condition

vulnerability
subclass of: professionally assessed condition

working diagnosis
subclass of: professionally assessed condition