professional health record
type: Concept
broader: health record
definition: health record held under the responsibility of one healthcare provider and maintained by one or several healthcare professionals
example: EXAMPLES Health records held at their surgery or at a health centre by a GP, by a medical specialist, by a nurse, in a hospital department at a patient's bedside, by a care team in an integrated clinical network, by a dentist.
in scheme: contsys.org
note: NOTE The responsible healthcare provider may allow the subject of care to access and/or offer contributions to the professional health record.
related: healthcare information for import
related: healthcare professional
related: healthcare provider
related: mandated period of care

hasPart
type: Property
comment: Expresses a partitive relationship between two concepts.
sub property of: narrower
inverse of: isPartOf

isPartOf
type: Property
comment: Expresses a partitive relationship between two concepts.
sub property of: broader
inverse of: hasPart