prescriber
type: Class
comment: role performed by a care professional when recommending or authorising a care activity
has metadata:
  namespace: directives.org.iso
  key: clauseType
  value: bodyAndTerm
has metadata:
  namespace: directives.org.iso
  key: figureTitle
  value: Figure 44 — prescriber (UML Representation)
has metadata:
  namespace: directives.org.iso
  key: plural
  value: prescribers
has metadata:
  namespace: directives.org.iso
  key: termClause
  value: 3.3.16
has metadata:
  namespace: directives.org.iso
  key: _profiled
  value: Yes
subclass of: care performer