prescribed third party activity
type: Class
comment: care third party activity prescribed by a care professional
has metadata:
  namespace: directives.org.iso
  key: clauseType
  value: bodyAndTerm
has metadata:
  namespace: directives.org.iso
  key: figureTitle
  value: Figure 59 — prescribed third party activity (UML Representation)
has metadata:
  namespace: directives.org.iso
  key: plural
  value: prescribed third party activities
has metadata:
  namespace: directives.org.iso
  key: termClause
  value: 3.4.8
has metadata:
  namespace: directives.org.iso
  key: _profiled
  value: Yes
has metadata:
  namespace: uk.ac.ox.softeng.maurodatamapper.xmi
  key: isAbstract
  value: false
subclass of: care third party activity