prescribed self-care period
has metadata:
  namespace: directives.org.iso
  key: clauseType
  value: bodyAndTerm
has metadata:
  namespace: directives.org.iso
  key: figureTitle
  value: Figure 87 — prescribed self-care period (UML Representation)
has metadata:
  namespace: directives.org.iso
  key: plural
  value: prescribed self-care periods
has metadata:
  namespace: directives.org.iso
  key: termClause
  value: 3.6.6
has metadata:
  namespace: directives.org.iso
  key: _profiled
  value: Yes
has metadata:
  namespace: uk.ac.ox.softeng.maurodatamapper.xmi
  key: isAbstract
  value: false
type: Class
comment: care activity period where prescribed self-care activity is performed
subclass of: care activity period