point of care
has metadata:
  namespace: directives.org.iso
  key: clauseType
  value: bodyAndTerm
has metadata:
  namespace: directives.org.iso
  key: example1
  value: Surgery room, ward, ambulance, roadside, home of the subject of care, school.
has metadata:
  namespace: directives.org.iso
  key: figureTitle
  value: Figure 46 — point of care (UML Representation)
has metadata:
  namespace: directives.org.iso
  key: note 1
  value: Location refers to the geographical location of the subject of care, not the body area of the subject of care that the treatment is applied to.
has metadata:
  namespace: directives.org.iso
  key: note 2
  value: Activities referred are not limited to care provider activities; self-care activities are included.
has metadata:
  namespace: directives.org.iso
  key: termClause
  value: 3.3.18
has metadata:
  namespace: directives.org.iso
  key: _profiled
  value: Yes
has metadata:
  namespace: uk.ac.ox.softeng.maurodatamapper.xmi
  key: isAbstract
  value: false
type: Class
comment: location where direct care activities are performed
subclass of: care resource
subclass of: Restriction
  min qualified cardinality: 1
  on class: subject of care