personal health record
type: Concept
broader: health record
definition: health record held and maintained by the subject of care or a subject of care proxy
in scheme: contsys.org
related: subject of care
related: subject of care proxy

hasPart
type: Property
comment: Expresses a partitive relationship between two concepts.
sub property of: narrower
inverse of: isPartOf

isPartOf
type: Property
comment: Expresses a partitive relationship between two concepts.
sub property of: broader
inverse of: hasPart