observed condition
type: Class
comment: health condition observed by a care actor
has metadata:
  namespace: directives.org.iso
  key: example1
  value: A blood pressure, a swelling in the abdomen, tachycardia, body weight, lung infiltration on x-ray, a haemoglobin value, pale skin.
has metadata:
  namespace: directives.org.iso
  key: figureTitle
  value: Figure 15 — observed condition (UML Representation)
has metadata:
  namespace: directives.org.iso
  key: note 1
  value: Care professionals and subjects of care are examples of care actors that can perceive the observed aspect of a health state.
has metadata:
  namespace: directives.org.iso
  key: note 2
  value: An observed condition is a health issue and as such is a representation of aspects of the health state.
has metadata:
  namespace: directives.org.iso
  key: plural
  value: observed conditions
has metadata:
  namespace: directives.org.iso
  key: synonym
  value: observed health condition
has metadata:
  namespace: directives.org.iso
  key: termClause
  value: 3.2.14
has metadata:
  namespace: directives.org.iso
  key: _profiled
  value: Yes
has metadata:
  namespace: uk.ac.ox.softeng.maurodatamapper.xmi
  key: isAbstract
  value: false
subclass of: health condition
subclass of: Restriction
  min qualified cardinality: 1
  on class: health condition period

professionally assessed condition
subclass of: observed condition