objection
type: Class
has metadata:
  key: clauseType
  namespace: directives.org.iso
  value: bodyAndTerm
has metadata:
  key: figureTitle
  namespace: directives.org.iso
  value: Figure 116 — objection (UML Representation)
has metadata:
  key: plural
  namespace: directives.org.iso
  value: objections
has metadata:
  key: termClause
  namespace: directives.org.iso
  value: 3.8.4
has metadata:
  key: _profiled
  namespace: directives.org.iso
  value: Yes
has metadata:
  key: isAbstract
  namespace: uk.ac.ox.softeng.maurodatamapper.xmi
  value: false
comment: subject of care desire that specific care activities are not performed
subclass of: subject of care desire
subclass of: Restriction
  min qualified cardinality: 1
  on class: consent competence