needed care activity
type: Class
comment: care activity bundle which includes those care activities assessed as needed to address a specified health need
has metadata:
  namespace: directives.org.iso
  key: admittedTerms
  value: needed care activity bundle
has metadata:
  namespace: directives.org.iso
  key: clauseType
  value: bodyAndTerm
has metadata:
  namespace: directives.org.iso
  key: figureTitle
  value: Figure 69 — needed care activity (UML Representation)
has metadata:
  namespace: directives.org.iso
  key: note 1
  value: Needed care activities are managed in a care plan.
has metadata:
  namespace: directives.org.iso
  key: note 2
  value: Needed care activities are the outcome of care needs assessments performed by mandated care professionals for a subject of care.
has metadata:
  namespace: directives.org.iso
  key: plural
  value: needed care activities
has metadata:
  namespace: directives.org.iso
  key: termClause
  value: 3.4.18
has metadata:
  namespace: directives.org.iso
  key: _profiled
  value: Yes
has metadata:
  namespace: uk.ac.ox.softeng.maurodatamapper.xmi
  key: isAbstract
  value: false
subclass of: care activity bundle
subclass of: Restriction
  min qualified cardinality: 1
  on class: health need