medical device
type: Class
comment: instrument, apparatus, implement, machine, appliance, implant, reagent for in vitro use, software, material or other similar or related article, intended by the manufacturer to be used, alone or in combination, for human beings, for one or more of the specific medical purposes of — diagnosis, prevention, monitoring, treatment or alleviation of disease, — diagnosis, monitoring, treatment, alleviation of or compensation for an injury, — investigation, replacement, modification, or support of the anatomy or of a physiological process, — supporting or sustaining life, — control of conception, — disinfection of medical devices, — providing information by means of in vitro examination of specimens derived from the human body, and which does not achieve its primary intended action by pharmacological, immunological or metabolic means, in or on the human body, but which can be assisted in its intended function by such means
has metadata:
  namespace: directives.org.iso
  key: clauseType
  value: bodyAndTerm
has metadata:
  namespace: directives.org.iso
  key: figureTitle
  value: Figure 47 — medical device (UML Representation)
has metadata:
  namespace: directives.org.iso
  key: note 1
  value: Products which can be considered to be medical devices in some jurisdictions but not in others include: — disinfection substances; — aids for persons with disabilities; — devices incorporating animal or human tissues, or both; — devices for in-vitro fertilization or assisted reproductive technologies.
has metadata:
  namespace: directives.org.iso
  key: plural
  value: medical devices
has metadata:
  namespace: directives.org.iso
  key: termClause
  value: 3.3.19
has metadata:
  namespace: directives.org.iso
  key: _profiled
  value: Yes
has metadata:
  namespace: ontology.external
  key: iri.dolce
  value: https://w3id.org/DOLCE/OWL/DOLCEbasic#PhysicalObject
has metadata:
  namespace: ontology.external
  key: prefix.dolce
  value: db
has metadata:
  namespace: ontology.external
  key: rdfsSubClassOf.dolce
  value: https://w3id.org/DOLCE/OWL/DOLCEbasic#PhysicalObject
has metadata:
  namespace: ontology.type
  key: ontologyId
  value: dolce=PhysicalObject
has metadata:
  namespace: uk.ac.ox.softeng.maurodatamapper.xmi
  key: isAbstract
  value: false
subclass of: care resource
subclass of: PhysicalObject

automatic medical device
subclass of: medical device