mandated period of care
type: Concept
alternative label: commissioned period of care
alternative label: period of care
alternative label: period of healthcare
broader: health related period
definition: set of healthcare activity periods where a healthcare provider is mandated to perform the healthcare activities required to address specific health needs
example: EXAMPLES A hospital stay, a series of radiotherapy sessions at an outpatient clinic.
in scheme: contsys.org
note: NOTE 1 The mandated period of care is focused upon the framework of a care commitment of the provider as well as the mandate from the subject of care, which means that the roles and responsibilities of both the interacting parts are respected. NOTE 2 Whenever the healthcare provider considered in a mandated period of care is a healthcare organization, this mandated period of care encompasses all healthcare activity periods with healthcare professionals who have a role in that healthcare organization. NOTE 3 A mandated period of care may be part of another mandated period of care. NOTE 4 In EN 13940-1:2007 period of care was the preferred term for this concept. NOTE 5 The relevant information describing and produced during the healthcare activities performed as a part of a mandated period of care is recorded in one or more professional health records.
related: care period mandate
related: clinical process
related: discharge report
related: healthcare activity delay
related: healthcare activity period
related: healthcare provider
related: professional health record

hasPart
type: Property
comment: Expresses a partitive relationship between two concepts.
sub property of: narrower
inverse of: isPartOf

isPartOf
type: Property
comment: Expresses a partitive relationship between two concepts.
sub property of: broader
inverse of: hasPart