intended outcome
type: Class
has metadata:
  key: clauseType
  namespace: directives.org.iso
  value: bodyAndTerm
has metadata:
  key: example1
  namespace: directives.org.iso
  value: To increase the survival of a subject of care with breast cancer in a breast cancer screening programme.
has metadata:
  key: example2
  namespace: directives.org.iso
  value: To reduce a subject of care risk of morbidity and mortality from tobacco-related diseases in a smoking cessation programme.
has metadata:
  key: example3
  namespace: directives.org.iso
  value: To decrease a subject of care risk of secondary effects to diabetes.
has metadata:
  key: figureTitle
  namespace: directives.org.iso
  value: Figure 101 — intended outcome (UML Representation)
has metadata:
  key: note 1
  namespace: directives.org.iso
  value: An intended outcome can be expressed as one or several target conditions to be reached within a specified date and time.
has metadata:
  key: plural
  namespace: directives.org.iso
  value: intended outcomes
has metadata:
  key: termClause
  namespace: directives.org.iso
  value: 3.7.3
has metadata:
  key: _profiled
  namespace: directives.org.iso
  value: Yes
has metadata:
  key: isAbstract
  namespace: uk.ac.ox.softeng.maurodatamapper.xmi
  value: false
comment: desired achievement of a care process addressing health needs
subclass of: health matter
subclass of: Restriction
  min qualified cardinality: 1
  on class: health need