integrated care plan
type: Class
comment: care plan crossing organizational, professional and contextual borders
has metadata:
  namespace: directives.org.iso
  key: clauseType
  value: bodyAndTerm
has metadata:
  namespace: directives.org.iso
  key: figureTitle
  value: Figure 109 — integrated care plan (UML Representation)
has metadata:
  namespace: directives.org.iso
  key: note 1
  value: Integrated care plans are the basis for planning to deliver continuity of care.
has metadata:
  namespace: directives.org.iso
  key: note 2
  value: Integrated care plans address physical, mental and social needs.
has metadata:
  namespace: directives.org.iso
  key: plural
  value: integrated care plans
has metadata:
  namespace: directives.org.iso
  key: synonym
  value: multi-professional care plan, multi-disciplinary care plan
has metadata:
  namespace: directives.org.iso
  key: termClause
  value: 3.7.11
has metadata:
  namespace: directives.org.iso
  key: _profiled
  value: Yes
has metadata:
  namespace: uk.ac.ox.softeng.maurodatamapper.xmi
  key: isAbstract
  value: false
subclass of: care plan