input health state
type: Class
comment: health state at the start of a care process
has metadata:
  namespace: directives.org.iso
  key: clauseType
  value: bodyAndTerm
has metadata:
  namespace: directives.org.iso
  key: figureTitle
  value: Figure 74 — input health state (UML Representation)
has metadata:
  namespace: directives.org.iso
  key: note 1
  value: The output health state from one care process may be the input health state to a subsequent care process.
has metadata:
  namespace: directives.org.iso
  key: plural
  value: input health states
has metadata:
  namespace: directives.org.iso
  key: termClause
  value: 3.5.3
has metadata:
  namespace: directives.org.iso
  key: _profiled
  value: Yes
has metadata:
  namespace: uk.ac.ox.softeng.maurodatamapper.xmi
  key: isAbstract
  value: false
subclass of: health state
subclass of: Restriction
  max qualified cardinality: 1
  on class: care process