initial request for care
type: Class
has metadata:
  key: admittedTerms
  namespace: directives.org.iso
  value: demand for initial contact
has metadata:
  key: clauseType
  namespace: directives.org.iso
  value: bodyAndTerm
has metadata:
  key: figureTitle
  namespace: directives.org.iso
  value: Figure 77 — initial request for care (UML Representation)
has metadata:
  key: plural
  namespace: directives.org.iso
  value: initial request for cares
has metadata:
  key: termClause
  namespace: directives.org.iso
  value: 3.5.6
has metadata:
  key: _profiled
  namespace: directives.org.iso
  value: Yes
has metadata:
  key: isAbstract
  namespace: uk.ac.ox.softeng.maurodatamapper.xmi
  value: false
comment: first request for care concerning one or more specific health matters to be assessed by a care provider
subclass of: request for care
subclass of: Restriction
  on class: initial contact
  qualified cardinality: 1