initial contact
type: Concept
broader: contact
definition: contact during which a clinical process is initiated
in scheme: contsys.org
related: clinical process
related: demand for initial contact
related: healthcare provider

hasPart
type: Property
comment: Expresses a partitive relationship between two concepts.
sub property of: narrower
inverse of: isPartOf

isPartOf
type: Property
comment: Expresses a partitive relationship between two concepts.
sub property of: broader
inverse of: hasPart