initial contact
type: Class
comment: care contact starting a continuity of care process
has metadata:
  namespace: directives.org.iso
  key: admittedTerms
  value: first contact
has metadata:
  namespace: directives.org.iso
  key: clauseType
  value: bodyAndTerm
has metadata:
  namespace: directives.org.iso
  key: figureTitle
  value: Figure 89 — initial contact (UML Representation)
has metadata:
  namespace: directives.org.iso
  key: plural
  value: initial contacts
has metadata:
  namespace: directives.org.iso
  key: termClause
  value: 3.6.8
has metadata:
  namespace: directives.org.iso
  key: _profiled
  value: Yes
has metadata:
  namespace: uk.ac.ox.softeng.maurodatamapper.xmi
  key: isAbstract
  value: false
subclass of: care contact
subclass of: Restriction
  min qualified cardinality: 1
  on class: continuity of care process