informed consent
has metadata:
  namespace: directives.org.iso
  key: clauseType
  value: bodyAndTerm
has metadata:
  namespace: directives.org.iso
  key: figureTitle
  value: Figure 115 — informed consent (UML Representation)
has metadata:
  namespace: directives.org.iso
  key: note 1
  value: A care mandate requires either informed consent or authorization by law.
has metadata:
  namespace: directives.org.iso
  key: plural
  value: informed consents
has metadata:
  namespace: directives.org.iso
  key: termClause
  value: 3.8.3
has metadata:
  namespace: directives.org.iso
  key: _profiled
  value: Yes
has metadata:
  namespace: uk.ac.ox.softeng.maurodatamapper.xmi
  key: isAbstract
  value: false
type: Class
comment: permission to perform care activities, voluntarily given by a subject of care with consent competence or by a subject of care proxy with consent competence after having been informed about the purpose and the possible results of the care activities
subclass of: subject of care desire
subclass of: care mandate
subclass of: Restriction
  min qualified cardinality: 1
  on class: consent competence