indirect healthcare activity period
type: Concept
alternative label: record contact
broader: healthcare activity period
definition: healthcare activity period without the involvement of the subject of care
example: EXAMPLE 1 The period where healthcare activities are performed without the presence of the subject of care in order to decide whether a referral or a demand for initial contact should be accepted or not EXAMPLE 2 Time spent working on laboratory or tissue specimens taken from a subject of care EXAMPLE 3 Period taken for the planning of care
in scheme: contsys.org
note: NOTE 1 In EN 13940-1:2007 the concept record contact was defined as 'contact restricted to the access to the professional health record of a subject of care by a healthcare professional for its management, out of the presence of that subject of care'.

hasPart
type: Property
comment: Expresses a partitive relationship between two concepts.
sub property of: narrower
inverse of: isPartOf

isPartOf
type: Property
comment: Expresses a partitive relationship between two concepts.
sub property of: broader
inverse of: hasPart