healthcare supporting organization
type: Concept
alternative label: care supporting organization
broader: healthcare third party
broader: organizational role
definition: healthcare third party having organizational role
example: EXAMPLES Voluntary aid organization, a homecare service organization, a health insurance fund, the operator of a telemedicine system, family.
in scheme: contsys.org

hasPart
type: Property
comment: Expresses a partitive relationship between two concepts.
sub property of: narrower
inverse of: isPartOf

isPartOf
type: Property
comment: Expresses a partitive relationship between two concepts.
sub property of: broader
inverse of: hasPart