healthcare resource management
type: Concept
definition: activities to direct and control the supply and use of the healthcare resources required to perform healthcare activities
related: healthcare activity
related: healthcare provider
related: healthcare resource
top concept of: contsys.org

hasPart
type: Property
comment: Expresses a partitive relationship between two concepts.
sub property of: narrower
inverse of: isPartOf

isPartOf
type: Property
comment: Expresses a partitive relationship between two concepts.
sub property of: broader
inverse of: hasPart