healthcare resource
type: Concept
broader: resource
definition: resource needed to perform healthcare activities
example: EXAMPLES Healthcare professional on duty, operation theatre, instruments ready to use, consultation rooms, bed in a ward, prepared medicinal products, Electrocardiography-device, blood sample, donated kidney, etc.
in scheme: contsys.org
narrower: healthcare personnel
narrower: medical device
narrower: medicinal product
narrower: point of care
note: NOTE As a healthcare process develops, the healthcare resources follow a life cycle. Examples of steps of such a life cycle are: 'available', 'booked', 'provided', ''in use', 'consumed', etc.
related: healthcare activity
related: healthcare funds
related: healthcare resource management

hasPart
type: Property
comment: Expresses a partitive relationship between two concepts.
sub property of: narrower
inverse of: isPartOf

isPartOf
type: Property
comment: Expresses a partitive relationship between two concepts.
sub property of: broader
inverse of: hasPart