healthcare provider
type: Concept
alternative label: care provider
alternative label: health provider
alternative label: health service provider
alternative label: healthcare service provider
broader: healthcare actor
definition: healthcare actor that is able to be assigned one or more care period mandates
in scheme: contsys.org
narrower: healthcare organization
narrower: healthcare professional
note: NOTE 1 The personnel of a healthcare organization that is a healthcare provider may include both healthcare professionals and others which participate in the provision of healthcare. NOTE 2 This International Standard includes only two specializations of healthcare provider. This is not meant to exclude the possibility of other specializations. In jurisdictions where other kinds of healthcare actors are included in the concept of healthcare provider, the necessary specializations may be added. NOTE 3 According to this definition, organizations solely responsible for the funding, payment, or reimbursement of healthcare provision are not healthcare providers; for the purpose of this International Standard they are considered as healthcare third parties.
related: care period mandate
related: demand for care
related: episode of care
related: healthcare
related: healthcare activity directory
related: healthcare commitment
related: healthcare provider activity
related: healthcare resource management
related: initial contact
related: mandated period of care
related: professional health record
related: resource delay

hasPart
type: Property
comment: Expresses a partitive relationship between two concepts.
sub property of: narrower
inverse of: isPartOf

isPartOf
type: Property
comment: Expresses a partitive relationship between two concepts.
sub property of: broader
inverse of: hasPart