healthcare process evaluation
type: Concept
broader: healthcare evaluation
definition: healthcare evaluation where healthcare processes are systematically assessed against requirements
in scheme: contsys.org
note: NOTE 1 The outputs of clinical processes are evaluated in a clinical process outcome evaluation. NOTE 2 Requirements are defined as a combination of needs and expectations that are stated, generally implied or obligatory. The needs can be represented by, for example, target conditions, goals for resource consumption, compliance to guidelines, etc. The expectations can be represented by the perceptions of the outcomes from each of the involved healthcare actor’s perspective (i.e. subject of care and healthcare professionals).
related: healthcare process

hasPart
type: Property
comment: Expresses a partitive relationship between two concepts.
sub property of: narrower
inverse of: isPartOf

isPartOf
type: Property
comment: Expresses a partitive relationship between two concepts.
sub property of: broader
inverse of: hasPart