healthcare information for import
type: Concept
broader: healthcare information
definition: healthcare information that is a candidate for import into a professional health record after a healthcare professional has confirmed its clinical relevance to that professional health record
in scheme: contsys.org
related: healthcare professional
related: healthcare provider activity
related: non-ratified healthcare information
related: professional health record

hasPart
type: Property
comment: Expresses a partitive relationship between two concepts.
sub property of: narrower
inverse of: isPartOf

isPartOf
type: Property
comment: Expresses a partitive relationship between two concepts.
sub property of: broader
inverse of: hasPart