healthcare funds
type: Concept
alternative label: care funds
broader: resource
definition: resource provided for funding healthcare delivery
in scheme: contsys.org
note: NOTE Funds may be provided by, for example, a health insurance fund, a governmental agency, a national or local authority, a welfare programme, the subject of care or any other person or organization having a role in the funding of healthcare.
related: healthcare
related: healthcare actor
related: healthcare resource

hasPart
type: Property
comment: Expresses a partitive relationship between two concepts.
sub property of: narrower
inverse of: isPartOf

isPartOf
type: Property
comment: Expresses a partitive relationship between two concepts.
sub property of: broader
inverse of: hasPart